{"text_format":"1","workbook":"xlsx","n_sheets":10,"sheets":["Info","Grant Summary","Grant Performance","Participant Satisfaction","Self Assessment","Grant Compliance","Star Rating Calculations","Control_Variables","Back_Sheet","Data for extraction"],"not_rendered":{"charts":0,"images":8,"macros":1,"external_links":0,"defined_names":71,"comments":1,"pivot_tables":0},"unopened":[],"bounds":{"document_bytes":16777216,"sheet_cells":100000,"rows_first":2000,"rows_last":500,"rows_between":2000,"halvings":0,"cell_chars":16384,"cell_head_chars":4096},"cells_cut":0,"cells_raw":0,"read":"whole","date_system":"1900"}

{"sheet":"Info","index":0,"n_rows":27,"n_cols":9,"rows_kept":27,"cut":false,"hidden":false,"merged":[[22,2,22,10],[4,1,4,8]]}
[]
[null,"Employability Performance Rating Calculator"]
[]
[null,"Grant Summary"]
[null,"Contains the options to load in the key information on the provider's grant to allow the setup of the calculator."]
[]
[null,"Grant Performance"]
[null,"Contains tables to enter outcomes for performance targets."]
{"$rows_left_out":20}
{"sheet":"Grant Summary","index":1,"n_rows":38,"n_cols":7,"rows_kept":38,"cut":false,"hidden":false,"merged":[[34,1,35,1],[34,2,35,2],[11,2,11,4],[12,2,12,4],[13,2,13,4],[14,2,14,4],[15,2,15,4],[16,2,16,4],[17,2,17,4],[18,2,18,4],[20,2,20,4],[19,2,19,4],[34,3,34,5]]}
[null,null,"Back to Info"]
[null,"Grant Summary"]
[null,"Contains the options to load in the key information on the provider's grant to allow the setup of the calculator"]
[]
[null,"Provider: ",null,"Grant:"]
[]
[]
[null,"Summary Grant Information"]
{"$rows_left_out":31}
{"sheet":"Grant Performance","index":2,"n_rows":19,"n_cols":22,"rows_kept":19,"cut":false,"hidden":false,"merged":[[14,1,18,2],[14,3,18,4],[14,5,14,6],[8,5,8,6],[1,1,1,2],[2,1,2,2],[1,3,1,4],[2,3,2,4],[6,3,6,4],[8,1,12,2],[8,3,12,4]]}
[]
[null,"Provider:",null,"Test Provider"]
[null,"Grant:",null,"Test Grant Name"]
[null,"Back to Info"]
[null,"Grant Performance"]
[null,"Contains tables to enter outcomes for performance targets"]
[null,null,null,"Performance measure",null,"Target Category",null,null,"APR 2018","MAY 2018","JUN 2018","JUL 2018","AUG 2018","SEP 2018","OCT 2018","NOV 2018","DEC 2018","JAN 2019","FEB 2019","MAR 2019","Annual Total","% of Target"]
[]
{"$rows_left_out":12}
{"sheet":"Participant Satisfaction","index":3,"n_rows":66,"n_cols":7,"rows_kept":66,"cut":false,"hidden":false,"merged":[[7,1,7,6],[22,1,22,6],[37,1,37,6],[52,1,52,6]]}
[]
[null,"Provider:","Test Provider"]
[null,"Grant:","Test Grant Name"]
[null,"Back to Info"]
[null,"Participant Satisfaction"]
[null,"Contains tables to enter record of responses of participant satisfaction."]
[]
[null,"Quarter 1 - APR-JUN 2018"]
{"$rows_left_out":59}
{"sheet":"Self Assessment","index":4,"n_rows":24,"n_cols":6,"rows_kept":24,"cut":false,"hidden":false,"merged":[[8,1,8,5],[12,1,12,5],[15,1,15,5],[22,1,22,5]]}
[]
[null,"Provider:","Test Provider"]
[null,"Grant:","Test Grant Name"]
[null,"Back to Info"]
[null,"Quality Self-Assessment"]
[null,"Contains tables to enter record of quality of the grant service as assessed by the contractor."]
[]
[null,"Question","In place?\nF = fully \nFI = fully in place but needs some improvement\nP = partially in place\nN = not in place/being developed\n","Evidence or examples of current practice","Assessment of level of performance\n\nRate 1 –  4\n1 = Outstanding; 2= Good; 3 = Satisfactory; 4 = Inadequate","Priority for action?\n\nRank 1 – 3\n1 = high priority"]
{"$rows_left_out":17}
{"sheet":"Grant Compliance","index":5,"n_rows":14,"n_cols":6,"rows_kept":14,"cut":false,"hidden":false,"merged":[[7,1,8,1],[7,2,8,2],[7,3,8,3]]}
[]
[null,"Provider:","Test Provider"]
[null,"Grant:","Test Grant Name"]
[null,"Back to Info"]
[null,"Grant Compliance"]
[null,"Contains tables to enter record of grant compliance as assessed by the grant manager."]
[]
[null,"A. Indicator","B. Assessment criteria","C. Guidance for rating","D. Rating          (1 - 10)","E. Comments"]
{"$rows_left_out":7}
{"sheet":"Star Rating Calculations","index":6,"n_rows":59,"n_cols":14,"rows_kept":59,"cut":false,"hidden":false,"merged":[[16,7,17,13],[16,5,17,6],[19,2,20,4],[19,5,19,13],[20,5,20,7],[20,8,20,10],[20,11,20,13],[14,1,14,5],[8,1,9,1],[10,1,12,1],[7,2,7,5],[8,2,8,5],[9,2,9,5],[10,2,10,5],[11,2,11,5],[1,2,1,3],[2,2,2,3],[7,9,7,13],[12,2,12,5],[13,2,13,5]]}
[]
[null,"Provider:","Test Provider"]
[null,"Grant:","Test Grant Name"]
[null,"Back to Info"]
[null,"Star Rating Calculations"]
[null,"Contains all the calculations for the components of the rating and calculates the final star rating"]
[]
[null,"KPA","Indicator",null,null,null,"Star rating points","Total available",null,"Star rating guidance"]
{"$rows_left_out":52}
{"sheet":"Control_Variables","index":7,"n_rows":47,"n_cols":28,"rows_kept":47,"cut":false,"hidden":false,"merged":[[1,9,1,10],[1,25,1,26],[7,25,7,26],[7,21,8,22],[7,23,8,24],[1,11,1,12],[1,21,5,22],[1,23,5,24]]}
[null,null,null,null,null,null,null,null,null,null,null,null,null,null,null,null,null,null,null,null,null,"FullModuleFormatting"]
[null,"OutcomePriorityList","OutcomeTargets","iRowNo","iSwitch","Providersgrants","ProviderList","Locations","iQSAFQuestions","StartSizes",null,"TextRange",null,null,null,null,null,null,null,null,null,"Primary Outcome",null,"Entry to Education/Training",null,"Annual Targets",null,"Monthly"]
[null,"Sustained Education/Training or Employment (52wks)","Grant",2,true,"Test Grant Name","Test Provider","Barking & Dagenham",12,null,200,"PrimaryOutcomeText","The outcome which is key to delivering the intended benefits/objectives of the project and will achieve the greatest long-term impact for the participant on the project. Ideally this should be the last outcome to be achieved by the participant on their journey on the project, which is most likely to be a sustained outcome, if these outcomes are less than 10% of the lifetime targets the second to last outcome on the participant journey should be selected and so on.",null,null,null,null,null,null,null,null,null,null,null,null,"Grant",10]
[null,"Sustained Employment (26wk)","BAME",null,null,"LLW",null,"Barnet",null,null,150,"ConfirmDetailsText","Once the provider has been selected and the information checked, click the ‘Confirm Details’ button to prepare the calculator. Please note that all other sheets will be reset and any data entered in the subsequent sheets will be cleared. When preparing the calculator for a new grant, it is advisable to first save the calculator workbook with a different name. ",null,null,null,null,null,null,null,null,null,null,null,null,"BAME",40]
[null,"Sustained Education/Training (26wk)","Disability",null,null,"Have a go",null,"Bexley",null,null,101,"PeriodSelectText","Choose the period for which data entry is required. Note: at the 6 month period no star rating is calculated.",null,null,null,null,null,null,null,null,null,null,null,null,"Disability",40]
[null,"Entry to Employment","Women",null,null,null,null,"Brent",null,null,51,"ProviderSelectText","Select your provider name. This will automatically populate this grant Summary sheet with the required data.",null,null,null,null,null,null,null,null,null,null,null,null,"Women",40]
[null,"Entry to Education/Training",null,null,null,null,null,"Bromley",null,null,0,null,null,null,null,null,null,null,null,null,null,"ReducedModuleFormatting"]
[null,"Work Placements",null,null,null,null,null,"Camden",null,null,null,null,null,null,null,null,null,null,null,null,null,"Primary Outcome",null,"Entry to Employment",null,"Annual Targets",null,"Monthly"]
{"$rows_left_out":40}
{"sheet":"Back_Sheet","index":8,"n_rows":8,"n_cols":181,"rows_kept":8,"cut":false,"hidden":false,"merged":[[3,48,5,48],[3,49,3,150],[3,151,3,180],[4,49,4,65],[4,66,4,82],[4,83,4,99],[4,100,4,116],[4,117,4,133],[4,134,4,150],[4,151,4,155],[4,156,4,160],[4,161,4,165],[4,166,4,170],[4,171,4,175],[4,176,4,180],[3,47,5,47],[3,36,5,36],[3,37,5,37],[3,38,5,38],[3,39,5,39],[3,40,5,40],[3,41,5,41],[3,42,5,42],[3,43,5,43],[3,44,5,44],[3,45,5,45],[3,46,5,46],[3,35,5,35],[3,24,5,24],[3,25,5,25],[3,26,5,26],[3,27,5,27],[3,28,5,28],[3,29,5,29],[3,30,5,30],[3,31,5,31],[3,32,5,32],[3,33,5,33],[3,34,5,34],[3,23,5,23],[3,12,5,12],[3,13,5,13],[3,14,5,14],[3,15,5,15],[3,16,5,16],[3,17,5,17],[3,18,5,18],[3,19,5,19],[3,20,5,20],[3,21,5,21],[3,22,5,22],[3,8,5,8],[3,9,5,9],[3,10,5,10],[3,11,5,11],[3,1,5,1],[3,2,5,2],[3,3,5,3],[3,4,5,4],[3,5,5,5],[3,6,5,6],[3,7,5,7]]}
[]
[]
[]
[null,"Provider","Year","Funder","Grant Name","Prime/Sub","Number of Sub-contractors","Target Group","grant start date","Year of grant","Grant Value","grant Description","Pan London","Barking & Dagenham","Barnet","Bexley","Brent","Bromley","Camden","City of London","Croydon","Ealing","Enfield","Greenwich","Hackney","Hammersmith & Fulham","Haringey","Harrow","Havering","Hillingdon","Hounslow","Islington","Kensington & Chelsea","Kingston","Lambeth","Lewisham","Merton","Newham","Redbridge","Richmond","Southwark","Sutton","Tower Hamlets","Waltham Forest","Wandsworth","Westminster","Funding Round and Spec","Number of Targets","Diversity Targets","Current Year Targets",null,null,null,null,null,null,null,null,null,null,null,null,null,null,null,null,null,null,null,null,null,null,null,null,null,null,null,null,null,null,null,null,null,null,null,null,null,null,null,null,null,null,null,null,null,null,null,null,null,null,null,null,null,null,null,null,null,null,null,null,null,null,null,null,null,null,null,null,null,null,null,null,null,null,null,null,null,null,null,null,null,null,null,null,null,null,null,null,null,null,null,null,null,null,null,null,null,null,null,null,null,"Lifetime Targets"]
[null,null,null,null,null,null,null,null,null,null,null,null,null,null,null,null,null,null,null,null,null,null,null,null,null,null,null,null,null,null,null,null,null,null,null,null,null,null,null,null,null,null,null,null,null,null,null,null,null,"Primary Target",null,null,null,null,null,null,null,null,null,null,null,null,null,null,null,null,"Target 2",null,null,null,null,null,null,null,null,null,null,null,null,null,null,null,null,"Target 3",null,null,null,null,null,null,null,null,null,null,null,null,null,null,null,null,"Target 4",null,null,null,null,null,null,null,null,null,null,null,null,null,null,null,null,"Target 5",null,null,null,null,null,null,null,null,null,null,null,null,null,null,null,null,"Target 6",null,null,null,null,null,null,null,null,null,null,null,null,null,null,null,null,"Primary Target",null,null,null,null,"Target 2",null,null,null,null,"Target 3",null,null,null,null,"Target 4",null,null,null,null,"Target 5",null,null,null,null,"Target 6"]
[null,null,null,null,null,null,null,null,null,null,null,null,null,null,null,null,null,null,null,null,null,null,null,null,null,null,null,null,null,null,null,null,null,null,null,null,null,null,null,null,null,null,null,null,null,null,null,null,null,"Target Type","Outcome Target","BAME Target (%)","Disability Target (%)","Women Target (%)","Outcome Target for APR","Outcome Target for MAY","Outcome Target for JUN","Outcome Target for JUL","Outcome Target for AUG","Outcome Target for SEP","Outcome Target for OCT","Outcome Target for NOV","Outcome Target for DEC","Outcome Target for JAN","Outcome Target for FEB","Outcome Target for MAR","Target Type","Outcome Target","BAME Target (%)","Disability Target (%)","Women Target (%)","Outcome Target for APR","Outcome Target for MAY","Outcome Target for JUN","Outcome Target for JUL","Outcome Target for AUG","Outcome Target for SEP","Outcome Target for OCT","Outcome Target for NOV","Outcome Target for DEC","Outcome Target for JAN","Outcome Target for FEB","Outcome Target for MAR","Target Type","Outcome Target","BAME Target (%)","Disability Target (%)","Women Target (%)","Outcome Target for APR","Outcome Target for MAY","Outcome Target for JUN","Outcome Target for JUL","Outcome Target for AUG","Outcome Target for SEP","Outcome Target for OCT","Outcome Target for NOV","Outcome Target for DEC","Outcome Target for JAN","Outcome Target for FEB","Outcome Target for MAR","Target Type","Outcome Target","BAME Target (%)","Disability Target (%)","Women Target (%)","Outcome Target for APR","Outcome Target for MAY","Outcome Target for JUN","Outcome Target for JUL","Outcome Target for AUG","Outcome Target for SEP","Outcome Target for OCT","Outcome Target for NOV","Outcome Target for DEC","Outcome Target for JAN","Outcome Target for FEB","Outcome Target for MAR","Target Type","Outcome Target","BAME Target (%)","Disability Target (%)","Women Target (%)","Outcome Target for APR","Outcome Target for MAY","Outcome Target for JUN","Outcome Target for JUL","Outcome Target for AUG","Outcome Target for SEP","Outcome Target for OCT","Outcome Target for NOV","Outcome Target for DEC","Outcome Target for JAN","Outcome Target for FEB","Outcome Target for MAR","Target Type","Outcome Target","BAME Target (%)","Disability Target (%)","Women Target (%)","Outcome Target for APR","Outcome Target for MAY","Outcome Target for JUN","Outcome Target for JUL","Outcome Target for AUG","Outcome Target for SEP","Outcome Target for OCT","Outcome Target for NOV","Outcome Target for DEC","Outcome Target for JAN","Outcome Target for FEB","Outcome Target for MAR","Lifetime Target Type","Lifetime Outcome Target","Lifetime BAME Target (%)","Lifetime Disability Target (%)","Lifetime Women Target (%)","Lifetime Target Type","Lifetime Outcome Target","Lifetime BAME Target (%)","Lifetime Disability Target (%)","Lifetime Women Target (%)","Lifetime Target Type","Lifetime Outcome Target","Lifetime BAME Target (%)","Lifetime Disability Target (%)","Lifetime Women Target (%)","Lifetime Target Type","Lifetime Outcome Target","Lifetime BAME Target (%)","Lifetime Disability Target (%)","Lifetime Women Target (%)","Lifetime Target Type","Lifetime Outcome Target","Lifetime BAME Target (%)","Lifetime Disability Target (%)","Lifetime Women Target (%)","Lifetime Target Type","Lifetime Outcome Target","Lifetime BAME Target (%)","Lifetime Disability Target (%)","Lifetime Women Target (%)"]
[null,"Provider","Year","Funder","Grant Name","Prime/Sub","Number of Sub-contractors","Target Group","grant start date","Year of grant","Grant Value","grant Description","Pan London","Barking & Dagenham","Barnet","Bexley","Brent","Bromley","Camden","City of London","Croydon","Ealing","Enfield","Greenwich","Hackney","Hammersmith & Fulham","Haringey","Harrow","Havering","Hillingdon","Hounslow","Islington","Kensington & Chelsea","Kingston","Lambeth","Lewisham","Merton","Newham","Redbridge","Richmond","Southwark","Sutton","Tower Hamlets","Waltham Forest","Wandsworth","Westminster","Funding Round and Spec","Number of Targets","Diversity Targets?","Target_1_Type","Target_1_Profile","Target_1_BAME","Target_1_Disability","Target_1_Women","Target_1_M1","Target_1_M2","Target_1_M3","Target_1_M4","Target_1_M5","Target_1_M6","Target_1_M7","Target_1_M8","Target_1_M9","Target_1_M10","Target_1_M11","Target_1_M12","Target_2_Type","Target_2_Profile","Target_2_BAME","Target_2_Disability","Target_2_Women","Target_2_M1","Target_2_M2","Target_2_M3","Target_2_M4","Target_2_M5","Target_2_M6","Target_2_M7","Target_2_M8","Target_2_M9","Target_2_M10","Target_2_M11","Target_2_M12","Target_3_Type","Target_3_Profile","Target_3_BAME","Target_3_Disability","Target_3_Women","Target_3_M1","Target_3_M2","Target_3_M3","Target_3_M4","Target_3_M5","Target_3_M6","Target_3_M7","Target_3_M8","Target_3_M9","Target_3_M10","Target_3_M11","Target_3_M12","Target_4_Type","Target_4_Profile","Target_4_BAME","Target_4_Disability","Target_4_Women","Target_4_M1","Target_4_M2","Target_4_M3","Target_4_M4","Target_4_M5","Target_4_M6","Target_4_M7","Target_4_M8","Target_4_M9","Target_4_M10","Target_4_M11","Target_4_M12","Target_5_Type","Target_5_Profile","Target_5_BAME","Target_5_Disability","Target_5_Women","Target_5_M1","Target_5_M2","Target_5_M3","Target_5_M4","Target_5_M5","Target_5_M6","Target_5_M7","Target_5_M8","Target_5_M9","Target_5_M10","Target_5_M11","Target_5_M12","Target_6_Type","Target_6_Profile","Target_6_BAME","Target_6_Disability","Target_6_Women","Target_6_M1","Target_6_M2","Target_6_M3","Target_6_M4","Target_6_M5","Target_6_M6","Target_6_M7","Target_6_M8","Target_6_M9","Target_6_M10","Target_6_M11","Target_6_M12","Life_Target_1_Type","Life_Target_1_Profile","Life_Target_1_BAME","Life_Target_1_Disability","Life_Target_1_Women","Life_Target_2_Type","Life_Target_2_Profile","Life_Target_2_BAME","Life_Target_2_Disability","Life_Target_2_Women","Life_Target_3_Type","Life_Target_3_Profile","Life_Target_3_BAME","Life_Target_3_Disability","Life_Target_3_Women","Life_Target_4_Type","Life_Target_4_Profile","Life_Target_4_BAME","Life_Target_4_Disability","Life_Target_4_Women","Life_Target_5_Type","Life_Target_5_Profile","Life_Target_5_BAME","Life_Target_5_Disability","Life_Target_5_Women","Life_Target_6_Type","Life_Target_6_Profile","Life_Target_6_BAME","Life_Target_6_Disability","Life_Target_6_Women"]
[null,"Test Provider","2018/19","Test Funder","Test Grant Name","Prime",5,"Test Target Group",2017,1,200000,"Test Grant Description",1,1,1,1,1,1,1,1,1,1,1,1,1,1,1,1,1,1,1,1,1,1,1,1,1,1,1,1,1,1,1,1,1,1,"ESF 2014-20 ",2,"Yes","Starts",250,20,20,60,20,20,20,20,20,20,20,20,20,20,25,25,"Jobs",150,20,20,60,10,10,10,10,10,10,15,15,15,15,15,15,"Sustained Employment",50,20,20,60,null,null,null,null,null,null,null,10,10,10,10,10,null,null,null,null,null,null,null,null,null,null,null,null,null,null,null,null,null,null,null,null,null,null,null,null,null,null,null,null,null,null,null,null,null,null,null,null,null,null,null,null,null,null,null,null,null,null,null,null,null,null,null,"Starts",1000,20,20,60,"Jobs",500,20,20,60,"Sustained Employment",250,20,20,60]
{"$rows_left_out":1}
{"sheet":"Data for extraction","index":9,"n_rows":17,"n_cols":92,"rows_kept":17,"cut":false,"hidden":false,"merged":[[3,2,4,2],[3,1,4,1],[3,3,4,3],[3,4,4,4],[3,5,4,5],[3,42,4,42],[3,44,4,44],[3,45,4,45],[3,46,4,46],[3,47,4,47],[3,43,4,43],[3,37,4,37],[3,38,4,38],[3,39,4,39],[3,40,4,40],[3,41,4,41],[3,50,4,50],[3,51,4,51],[3,52,4,52],[3,53,4,53],[3,48,4,48],[3,49,4,49],[3,36,4,36],[3,25,4,25],[3,26,4,26],[3,27,4,27],[3,28,4,28],[3,29,4,29],[3,30,4,30],[3,32,4,32],[3,33,4,33],[3,34,4,34],[3,35,4,35],[3,31,4,31],[3,6,4,6],[3,24,4,24],[3,8,3,14],[3,15,4,15],[3,16,4,16],[3,17,4,17],[3,18,4,18],[3,20,4,20],[3,21,4,21],[3,22,4,22],[3,23,4,23],[3,19,4,19],[3,7,4,7]]}
[]
[null,"Master Data requirements"]
[]
[null,"Funder","Rating Year","Provider","Grant Name","Prime/Sub","Stars","Comments","12 Month Stocktake Performance Rating Points ",null,null,null,null,null,null,"Target Group","Primary Outcome","No. of starters ","Year of Delivery","Pan London","Barking & Dagenham","Barnet","Bexley","Brent","Bromley","Camden","City of London","Croydon","Ealing","Enfield","Greenwich","Hackney","Hammersmith & Fulham","Haringey","Harrow","Havering","Hillingdon","Hounslow","Islington","Kensington & Chelsea","Kingston","Lambeth","Lewisham","Merton","Newham","Redbridge","Richmond","Southwark","Sutton","Tower Hamlets","Waltham Forest","Wandsworth","Westminster","Funding Round and Spec"]
[null,null,null,null,null,null,null,null,"Total %","Delivery (Max: 48)","Diversity (Max: 12)","Conversion (Max: 12)","Self Assessment (Max: 9)","Participant Satisfaction (Max: 9)","Grant Compliance (Max:10)"]
[null,{"$f":"'Grant Summary'!C12","v":"Test Funder"},{"$f":"CalcYear","v":"2018/19"},"Test Provider",{"$f":"GrantName","v":"Test Grant Name"},{"$f":"'Grant Summary'!C14","v":"Prime"},0,{"$f":"RatingComment","v":0},{"$f":"StarRatingPoints","v":0},{"$f":"'Star Rating Calculations'!G9","v":0},{"$f":"'Star Rating Calculations'!G10","v":0},{"$f":"'Star Rating Calculations'!G11","v":0},{"$f":"'Star Rating Calculations'!G12","v":0},{"$f":"'Star Rating Calculations'!G13","v":0},{"$f":"'Star Rating Calculations'!G14","v":0},{"$f":"'Grant Summary'!C18","v":"Test Target Group"},"Starts",{"$f":"VLOOKUP(\"Starts\",PerfomCalcTable,3,FALSE)*INDEX(ConversionCalcTable,1,2)","v":0},{"$f":"'Grant Summary'!C17","v":1},{"$f":"VLOOKUP(ProviderName,Back_Sheet_Table,MATCH('Data for extraction'!T4,INDEX(Back_Sheet_Table,1,0),0),FALSE)","v":1},{"$f":"VLOOKUP(ProviderName,Back_Sheet_Table,MATCH('Data for extraction'!U4,INDEX(Back_Sheet_Table,1,0),0),FALSE)","v":1},{"$f":"VLOOKUP(ProviderName,Back_Sheet_Table,MATCH('Data for extraction'!V4,INDEX(Back_Sheet_Table,1,0),0),FALSE)","v":1},{"$f":"VLOOKUP(ProviderName,Back_Sheet_Table,MATCH('Data for extraction'!W4,INDEX(Back_Sheet_Table,1,0),0),FALSE)","v":1},{"$f":"VLOOKUP(ProviderName,Back_Sheet_Table,MATCH('Data for extraction'!X4,INDEX(Back_Sheet_Table,1,0),0),FALSE)","v":1},{"$f":"VLOOKUP(ProviderName,Back_Sheet_Table,MATCH('Data for extraction'!Y4,INDEX(Back_Sheet_Table,1,0),0),FALSE)","v":1},{"$f":"VLOOKUP(ProviderName,Back_Sheet_Table,MATCH('Data for extraction'!Z4,INDEX(Back_Sheet_Table,1,0),0),FALSE)","v":1},{"$f":"VLOOKUP(ProviderName,Back_Sheet_Table,MATCH('Data for extraction'!AA4,INDEX(Back_Sheet_Table,1,0),0),FALSE)","v":1},{"$f":"VLOOKUP(ProviderName,Back_Sheet_Table,MATCH('Data for extraction'!AB4,INDEX(Back_Sheet_Table,1,0),0),FALSE)","v":1},{"$f":"VLOOKUP(ProviderName,Back_Sheet_Table,MATCH('Data for extraction'!AC4,INDEX(Back_Sheet_Table,1,0),0),FALSE)","v":1},{"$f":"VLOOKUP(ProviderName,Back_Sheet_Table,MATCH('Data for extraction'!AD4,INDEX(Back_Sheet_Table,1,0),0),FALSE)","v":1},{"$f":"VLOOKUP(ProviderName,Back_Sheet_Table,MATCH('Data for extraction'!AE4,INDEX(Back_Sheet_Table,1,0),0),FALSE)","v":1},{"$f":"VLOOKUP(ProviderName,Back_Sheet_Table,MATCH('Data for extraction'!AF4,INDEX(Back_Sheet_Table,1,0),0),FALSE)","v":1},{"$f":"VLOOKUP(ProviderName,Back_Sheet_Table,MATCH('Data for extraction'!AG4,INDEX(Back_Sheet_Table,1,0),0),FALSE)","v":1},{"$f":"VLOOKUP(ProviderName,Back_Sheet_Table,MATCH('Data for extraction'!AH4,INDEX(Back_Sheet_Table,1,0),0),FALSE)","v":1},{"$f":"VLOOKUP(ProviderName,Back_Sheet_Table,MATCH('Data for extraction'!AI4,INDEX(Back_Sheet_Table,1,0),0),FALSE)","v":1},{"$f":"VLOOKUP(ProviderName,Back_Sheet_Table,MATCH('Data for extraction'!AJ4,INDEX(Back_Sheet_Table,1,0),0),FALSE)","v":1},{"$f":"VLOOKUP(ProviderName,Back_Sheet_Table,MATCH('Data for extraction'!AK4,INDEX(Back_Sheet_Table,1,0),0),FALSE)","v":1},{"$f":"VLOOKUP(ProviderName,Back_Sheet_Table,MATCH('Data for extraction'!AL4,INDEX(Back_Sheet_Table,1,0),0),FALSE)","v":1},{"$f":"VLOOKUP(ProviderName,Back_Sheet_Table,MATCH('Data for extraction'!AM4,INDEX(Back_Sheet_Table,1,0),0),FALSE)","v":1},{"$f":"VLOOKUP(ProviderName,Back_Sheet_Table,MATCH('Data for extraction'!AN4,INDEX(Back_Sheet_Table,1,0),0),FALSE)","v":1},{"$f":"VLOOKUP(ProviderName,Back_Sheet_Table,MATCH('Data for extraction'!AO4,INDEX(Back_Sheet_Table,1,0),0),FALSE)","v":1},{"$f":"VLOOKUP(ProviderName,Back_Sheet_Table,MATCH('Data for extraction'!AP4,INDEX(Back_Sheet_Table,1,0),0),FALSE)","v":1},{"$f":"VLOOKUP(ProviderName,Back_Sheet_Table,MATCH('Data for extraction'!AQ4,INDEX(Back_Sheet_Table,1,0),0),FALSE)","v":1},{"$f":"VLOOKUP(ProviderName,Back_Sheet_Table,MATCH('Data for extraction'!AR4,INDEX(Back_Sheet_Table,1,0),0),FALSE)","v":1},{"$f":"VLOOKUP(ProviderName,Back_Sheet_Table,MATCH('Data for extraction'!AS4,INDEX(Back_Sheet_Table,1,0),0),FALSE)","v":1},{"$f":"VLOOKUP(ProviderName,Back_Sheet_Table,MATCH('Data for extraction'!AT4,INDEX(Back_Sheet_Table,1,0),0),FALSE)","v":1},{"$f":"VLOOKUP(ProviderName,Back_Sheet_Table,MATCH('Data for extraction'!AU4,INDEX(Back_Sheet_Table,1,0),0),FALSE)","v":1},{"$f":"VLOOKUP(ProviderName,Back_Sheet_Table,MATCH('Data for extraction'!AV4,INDEX(Back_Sheet_Table,1,0),0),FALSE)","v":1},{"$f":"VLOOKUP(ProviderName,Back_Sheet_Table,MATCH('Data for extraction'!AW4,INDEX(Back_Sheet_Table,1,0),0),FALSE)","v":1},{"$f":"VLOOKUP(ProviderName,Back_Sheet_Table,MATCH('Data for extraction'!AX4,INDEX(Back_Sheet_Table,1,0),0),FALSE)","v":1},{"$f":"VLOOKUP(ProviderName,Back_Sheet_Table,MATCH('Data for extraction'!AY4,INDEX(Back_Sheet_Table,1,0),0),FALSE)","v":1},{"$f":"VLOOKUP(ProviderName,Back_Sheet_Table,MATCH('Data for extraction'!AZ4,INDEX(Back_Sheet_Table,1,0),0),FALSE)","v":1},{"$f":"VLOOKUP(ProviderName,Back_Sheet_Table,MATCH('Data for extraction'!BA4,INDEX(Back_Sheet_Table,1,0),0),FALSE)","v":1},{"$f":"'Grant Summary'!C18","v":"Test Target Group"}]
[]
[null,"Grant Performance information"]
{"$rows_left_out":9}